Target
Group IIE secretory phospholipase A2
Ligand
BDBM50262842
Substrate
Meas. Tech.
ChEMBL_489274 (CHEMBL990830)
IC50
7±n/a nM
Citation
 Oslund, RCCermak, NGelb, MH Highly specific and broadly potent inhibitors of mammalian secreted phospholipases A2. J Med Chem 51:4708-14 (2008)  
Target
Name:
Group IIE secretory phospholipase A2
Synonyms:
GIIE sPLA2 PLA2G2E sPLA(2)-IIE
Type:
PROTEIN
Mol. Mass.:
15997.10
Organism:
Homo sapiens (Human)
Description:
ChEMBL_489274
Residue:
142
  
Inhibitor
Name:
BDBM50262842
Synonyms:
Benzenesulfonyl-2-(3-(2-amino-2-oxoacetyl)-1-benzyl-2-ethyl-1H-indol-4-yloxy)acetamide | CHEMBL514692
Type:
Small organic molecule
Emp. Form.:
C27H25N3O6S
Mol. Mass.:
519.569
SMILES:
CCc1c(C(=O)C(N)=O)c2c(OCC(=O)NS(=O)(=O)c3ccccc3)cccc2n1Cc1ccccc1
: