Target
Group IIE secretory phospholipase A2
Ligand
BDBM50263003
Substrate
Meas. Tech.
ChEMBL_489274 (CHEMBL990830)
IC50
20±n/a nM
Citation
 Oslund, RCCermak, NGelb, MH Highly specific and broadly potent inhibitors of mammalian secreted phospholipases A2. J Med Chem 51:4708-14 (2008)  
Target
Name:
Group IIE secretory phospholipase A2
Synonyms:
GIIE sPLA2 PLA2G2E sPLA(2)-IIE
Type:
PROTEIN
Mol. Mass.:
15997.10
Organism:
Homo sapiens (Human)
Description:
ChEMBL_489274
Residue:
142
  
Inhibitor
Name:
BDBM50263003
Synonyms:
2-(2-ethyl-3-(o-phenylbenzyl)-8-(2-oxopropoxy)indolizin-1-yl)-2-oxoacetamide | CHEMBL514841
Type:
Small organic molecule
Emp. Form.:
C24H22N2O3
Mol. Mass.:
386.4431
SMILES:
CCc1c(C(=O)C(N)=O)c2c(OC)cc3ccccc3c2n1Cc1ccccc1
: