Target
Fatty-acid amide hydrolase 1
Ligand
BDBM50234023
Substrate
Meas. Tech.
ChEMBL_557657 (CHEMBL961607)
pH
9±n/a
Ki
28±n/a nM
Comments
extracted
Citation
 Slaymaker, IMBracey, MMileni, MGarfunkle, JCravatt, BFBoger, DLStevens, RC Correlation of inhibitor effects on enzyme activity and thermal stability for the integral membrane protein fatty acid amide hydrolase. Bioorg Med Chem Lett 18:5847-50 (2008)  
Target
Name:
Fatty-acid amide hydrolase 1
Synonyms:
Anandamide amidohydrolase FAAH FAAH1_HUMAN Fatty-acid amide hydrolase (FAAH) Oleamide hydrolase 1
Type:
Protein
Mol. Mass.:
63071.19
Organism:
Homo sapiens (Human)
Description:
O00519
Residue:
579
  
Inhibitor
Name:
BDBM50234023
Synonyms:
6-(2-(3-(4'-(thiomorpholinomethyl)biphenyl-4-yl)propanoyl)oxazol-5-yl)picolinic acid CHEMBL410933
Type:
Small organic molecule
Emp. Form.:
C29H27N3O4S
Mol. Mass.:
513.607
SMILES:
OC(=O)c1cccc(n1)-c1cnc(o1)C(=O)CCc1ccc(cc1)-c1ccc(CN2CCSCC2)cc1
: