Target
Fatty-acid amide hydrolase 1
Ligand
BDBM50163187
Substrate
Meas. Tech.
ChEMBL_557657 (CHEMBL961607)
pH
9±n/a
Ki
80±n/a nM
Comments
extracted
Citation
 Slaymaker, IMBracey, MMileni, MGarfunkle, JCravatt, BFBoger, DLStevens, RC Correlation of inhibitor effects on enzyme activity and thermal stability for the integral membrane protein fatty acid amide hydrolase. Bioorg Med Chem Lett 18:5847-50 (2008)  
Target
Name:
Fatty-acid amide hydrolase 1
Synonyms:
Anandamide amidohydrolase FAAH FAAH1_HUMAN Fatty-acid amide hydrolase (FAAH) Oleamide hydrolase 1
Type:
Protein
Mol. Mass.:
63071.19
Organism:
Homo sapiens (Human)
Description:
O00519
Residue:
579
  
Inhibitor
Name:
BDBM50163187
Synonyms:
7-Phenyl-1-(5-phenyl-oxazol-2-yl)-heptan-1-one CHEMBL173992
Type:
Small organic molecule
Emp. Form.:
C22H23NO2
Mol. Mass.:
333.4235
SMILES:
O=C(CCCCCCc1ccccc1)c1ncc(o1)-c1ccccc1
: