Target
Fatty-acid amide hydrolase 1
Ligand
BDBM23078
Substrate
Meas. Tech.
ChEMBL_557657 (CHEMBL961607)
pH
9±n/a
Ki
0.75±n/a nM
Comments
extracted
Citation
 Slaymaker, IMBracey, MMileni, MGarfunkle, JCravatt, BFBoger, DLStevens, RC Correlation of inhibitor effects on enzyme activity and thermal stability for the integral membrane protein fatty acid amide hydrolase. Bioorg Med Chem Lett 18:5847-50 (2008)  
Target
Name:
Fatty-acid amide hydrolase 1
Synonyms:
Anandamide amidohydrolase FAAH FAAH1_HUMAN Fatty-acid amide hydrolase (FAAH) Oleamide hydrolase 1
Type:
Protein
Mol. Mass.:
63071.19
Organism:
Homo sapiens (Human)
Description:
O00519
Residue:
579
  
Inhibitor
Name:
BDBM23078
Synonyms:
3-(4-phenylphenyl)-1-[5-(pyridin-2-yl)-1,3-oxazol-2-yl]propan-1-one alpha-ketooxazole, 11j
Type:
Small organic molecule
Emp. Form.:
C23H18N2O2
Mol. Mass.:
354.4012
SMILES:
O=C(CCc1ccc(cc1)-c1ccccc1)c1ncc(o1)-c1ccccn1
: