Target
Fatty-acid amide hydrolase 1
Ligand
BDBM50246579
Substrate
Meas. Tech.
ChEMBL_557657 (CHEMBL961607)
pH
9±n/a
Ki
14±n/a nM
Comments
extracted
Citation
 Slaymaker, IMBracey, MMileni, MGarfunkle, JCravatt, BFBoger, DLStevens, RC Correlation of inhibitor effects on enzyme activity and thermal stability for the integral membrane protein fatty acid amide hydrolase. Bioorg Med Chem Lett 18:5847-50 (2008)  
Target
Name:
Fatty-acid amide hydrolase 1
Synonyms:
Anandamide amidohydrolase FAAH FAAH1_HUMAN Fatty-acid amide hydrolase (FAAH) Oleamide hydrolase 1
Type:
Protein
Mol. Mass.:
63071.19
Organism:
Homo sapiens (Human)
Description:
O00519
Residue:
579
  
Inhibitor
Name:
BDBM50246579
Synonyms:
6-(5-(7-Phenylheptanoyl)-1,3,4-oxadiazol-2-yl)-picolinic Acid CHEMBL461163
Type:
Small organic molecule
Emp. Form.:
C21H21N3O4
Mol. Mass.:
379.4091
SMILES:
OC(=O)c1cccc(n1)-c1nnc(o1)C(=O)CCCCCCc1ccccc1
: