Target
Fatty-acid amide hydrolase 1
Ligand
BDBM50204516
Substrate
Meas. Tech.
ChEMBL_557658 (CHEMBL961608)
pH
7.5±n/a
Ki
10.4±n/a nM
Comments
extracted
Citation
 Slaymaker, IMBracey, MMileni, MGarfunkle, JCravatt, BFBoger, DLStevens, RC Correlation of inhibitor effects on enzyme activity and thermal stability for the integral membrane protein fatty acid amide hydrolase. Bioorg Med Chem Lett 18:5847-50 (2008)  
Target
Name:
Fatty-acid amide hydrolase 1
Synonyms:
Anandamide amidohydrolase FAAH FAAH1_HUMAN Fatty-acid amide hydrolase (FAAH) Oleamide hydrolase 1
Type:
Protein
Mol. Mass.:
63071.19
Organism:
Homo sapiens (Human)
Description:
O00519
Residue:
579
  
Inhibitor
Name:
BDBM50204516
Synonyms:
6-(2-(7-phenylheptanoyl)oxazol-5-yl)picolinic acid CHEMBL219942
Type:
Small organic molecule
Emp. Form.:
C22H22N2O4
Mol. Mass.:
378.4211
SMILES:
OC(=O)c1cccc(n1)-c1cnc(o1)C(=O)CCCCCCc1ccccc1
: