Target
Macrophage colony-stimulating factor 1 receptor
Ligand
BDBM50244897
Substrate
Meas. Tech.
ChEMBL_512118 (CHEMBL980054)
IC50
31±n/a nM
Citation
 Scott, DAAquila, BMBebernitz, GACook, DJDakin, LADeegan, TLHattersley, MMIoannidis, SLyne, PDOmer, CAYe, MZheng, X Pyridyl and thiazolyl bisamide CSF-1R inhibitors for the treatment of cancer. Bioorg Med Chem Lett 18:4794-7 (2008)  
Target
Name:
Macrophage colony-stimulating factor 1 receptor
Synonyms:
CSF1R FMS Macrophage colony stimulating factor receptor Macrophage colony-stimulating factor 1 receptor (c-FMS) Proto-oncogene c-Fms c-fms | cFMS
Type:
Protein
Mol. Mass.:
107979.48
Organism:
Homo sapiens (Human)
Description:
P07333
Residue:
972
  
Inhibitor
Name:
BDBM50244897
Synonyms:
CHEMBL472343 | N-(4-chloro-3-{[2-(propan-2-yl)-1,3-thiazol-5-yl]carbamoyl}phenyl)-3,5-dimethylbenzamide
Type:
Small organic molecule
Emp. Form.:
C22H22ClN3O2S
Mol. Mass.:
427.947
SMILES:
CC(C)c1ncc(NC(=O)c2cc(NC(=O)c3cc(C)cc(C)c3)ccc2Cl)s1
: