Target
Macrophage colony-stimulating factor 1 receptor
Ligand
BDBM50244725
Substrate
Meas. Tech.
ChEMBL_512118 (CHEMBL980054)
IC50
3±n/a nM
Citation
 Scott, DAAquila, BMBebernitz, GACook, DJDakin, LADeegan, TLHattersley, MMIoannidis, SLyne, PDOmer, CAYe, MZheng, X Pyridyl and thiazolyl bisamide CSF-1R inhibitors for the treatment of cancer. Bioorg Med Chem Lett 18:4794-7 (2008)  
Target
Name:
Macrophage colony-stimulating factor 1 receptor
Synonyms:
CSF1R FMS Macrophage colony stimulating factor receptor Macrophage colony-stimulating factor 1 receptor (c-FMS) Proto-oncogene c-Fms c-fms | cFMS
Type:
Protein
Mol. Mass.:
107979.48
Organism:
Homo sapiens (Human)
Description:
P07333
Residue:
972
  
Inhibitor
Name:
BDBM50244725
Synonyms:
2-chloro-5-[(3,5-dichlorobenzoyl)amino]-N-pyridin-3-ylbenzamide | CHEMBL459674
Type:
Small organic molecule
Emp. Form.:
C19H12Cl3N3O2
Mol. Mass.:
420.676
SMILES:
Clc1cc(Cl)cc(c1)C(=O)Nc1ccc(Cl)c(c1)C(=O)Nc1cccnc1
: