Target
Macrophage colony-stimulating factor 1 receptor
Ligand
BDBM50244629
Substrate
Meas. Tech.
ChEMBL_512118 (CHEMBL980054)
IC50
37±n/a nM
Citation
 Scott, DAAquila, BMBebernitz, GACook, DJDakin, LADeegan, TLHattersley, MMIoannidis, SLyne, PDOmer, CAYe, MZheng, X Pyridyl and thiazolyl bisamide CSF-1R inhibitors for the treatment of cancer. Bioorg Med Chem Lett 18:4794-7 (2008)  
Target
Name:
Macrophage colony-stimulating factor 1 receptor
Synonyms:
CSF1R FMS Macrophage colony stimulating factor receptor Macrophage colony-stimulating factor 1 receptor (c-FMS) Proto-oncogene c-Fms c-fms | cFMS
Type:
Protein
Mol. Mass.:
107979.48
Organism:
Homo sapiens (Human)
Description:
P07333
Residue:
972
  
Inhibitor
Name:
BDBM50244629
Synonyms:
2-Methyl-N-pyridin-3-yl-5-(3-trifluoromethyl-benzoylamino)-benzamide 2-methyl-N-(pyridin-3-yl)-5-(3-(trifluoromethyl)benzamido)benzamide | CHEMBL454104
Type:
Small organic molecule
Emp. Form.:
C21H16F3N3O2
Mol. Mass.:
399.3658
SMILES:
Cc1ccc(NC(=O)c2cccc(c2)C(F)(F)F)cc1C(=O)Nc1cccnc1
: