Target
Macrophage colony-stimulating factor 1 receptor
Ligand
BDBM50244581
Substrate
Meas. Tech.
ChEMBL_512118 (CHEMBL980054)
IC50
89±n/a nM
Citation
 Scott, DAAquila, BMBebernitz, GACook, DJDakin, LADeegan, TLHattersley, MMIoannidis, SLyne, PDOmer, CAYe, MZheng, X Pyridyl and thiazolyl bisamide CSF-1R inhibitors for the treatment of cancer. Bioorg Med Chem Lett 18:4794-7 (2008)  
Target
Name:
Macrophage colony-stimulating factor 1 receptor
Synonyms:
CSF1R FMS Macrophage colony stimulating factor receptor Macrophage colony-stimulating factor 1 receptor (c-FMS) Proto-oncogene c-Fms c-fms | cFMS
Type:
Protein
Mol. Mass.:
107979.48
Organism:
Homo sapiens (Human)
Description:
P07333
Residue:
972
  
Inhibitor
Name:
BDBM50244581
Synonyms:
CHEMBL454616 | N-(2-methyl-5-(3-(N-methylmethan-3-ylsulfonamido)benzamido)phenyl)quinoline-6-carboxamide
Type:
Small organic molecule
Emp. Form.:
C26H24N4O4S
Mol. Mass.:
488.558
SMILES:
CN(c1cccc(c1)C(=O)Nc1ccc(C)c(NC(=O)c2ccc3ncccc3c2)c1)S(C)(=O)=O
: