Target
Glucose-dependent insulinotropic receptor
Ligand
BDBM50244591
Substrate
Meas. Tech.
ChEMBL_512176 (CHEMBL968035)
EC50
260±n/a nM
Citation
 Semple, GFioravanti, BPereira, GCalderon, IUy, JChoi, KXiong, YRen, AMorgan, MDave, VThomsen, WUnett, DJXing, CBossie, SCarroll, CChu, ZLGrottick, AJHauser, EKLeonard, JJones, RM Discovery of the first potent and orally efficacious agonist of the orphan G-protein coupled receptor 119. J Med Chem 51:5172-5 (2008)  
Target
Name:
Glucose-dependent insulinotropic receptor
Synonyms:
G-protein coupled receptor 119 (GPR119) GPR119 | Glucose-dependent insulinotropic receptor
Type:
Protein
Mol. Mass.:
36901.49
Organism:
Homo sapiens (Human)
Description:
Q8TDV5
Residue:
335
  
Inhibitor
Name:
BDBM50244591
Synonyms:
(4-Methanesulfonyl-phenyl)-{6-[4-(3-methyl-[1,2,4]oxadiazol-5-yl)-piperidin-1-yl]-5-nitro-pyrimidin-4-yl}-amine | CHEMBL507711
Type:
Small organic molecule
Emp. Form.:
C19H21N7O5S
Mol. Mass.:
459.479
SMILES:
Cc1nc([o+][n-]1)C1CCN(CC1)c1ncnc(Nc2ccc(cc2)S(C)(=O)=O)c1[N+]([O-])=O
: