Target
Glucose-dependent insulinotropic receptor
Ligand
BDBM50244793
Substrate
Meas. Tech.
ChEMBL_512176 (CHEMBL968035)
EC50
7.9±n/a nM
Citation
 Semple, GFioravanti, BPereira, GCalderon, IUy, JChoi, KXiong, YRen, AMorgan, MDave, VThomsen, WUnett, DJXing, CBossie, SCarroll, CChu, ZLGrottick, AJHauser, EKLeonard, JJones, RM Discovery of the first potent and orally efficacious agonist of the orphan G-protein coupled receptor 119. J Med Chem 51:5172-5 (2008)  
Target
Name:
Glucose-dependent insulinotropic receptor
Synonyms:
G-protein coupled receptor 119 (GPR119) GPR119 | Glucose-dependent insulinotropic receptor
Type:
Protein
Mol. Mass.:
36901.49
Organism:
Homo sapiens (Human)
Description:
Q8TDV5
Residue:
335
  
Inhibitor
Name:
BDBM50244793
Synonyms:
3-fluoro-N-isopropyl-4-(6-(4-(3-isopropyl-1,2,4-oxadiazol-5-yl)piperidin-1-yl)-5-nitropyrimidin-4-ylamino)benzenesulfonamide | CHEMBL461560
Type:
Small organic molecule
Emp. Form.:
C23H28FN7O5S
Mol. Mass.:
533.576
SMILES:
CC(C)c1nc([o+][n-]1)C1CCN(CC1)c1ncnc(Nc2ccc(cc2F)S(=O)(=O)C(C)C)c1[N+]([O-])=O
: