Target
Glucose-dependent insulinotropic receptor
Ligand
BDBM50244733
Substrate
Meas. Tech.
ChEMBL_512176 (CHEMBL968035)
EC50
7.8±n/a nM
Citation
 Semple, GFioravanti, BPereira, GCalderon, IUy, JChoi, KXiong, YRen, AMorgan, MDave, VThomsen, WUnett, DJXing, CBossie, SCarroll, CChu, ZLGrottick, AJHauser, EKLeonard, JJones, RM Discovery of the first potent and orally efficacious agonist of the orphan G-protein coupled receptor 119. J Med Chem 51:5172-5 (2008)  
Target
Name:
Glucose-dependent insulinotropic receptor
Synonyms:
G-protein coupled receptor 119 (GPR119) GPR119 | Glucose-dependent insulinotropic receptor
Type:
Protein
Mol. Mass.:
36901.49
Organism:
Homo sapiens (Human)
Description:
Q8TDV5
Residue:
335
  
Inhibitor
Name:
BDBM50244733
Synonyms:
6-(4-(3-isopropyl-1,2,4-oxadiazol-5-yl)piperidin-1-yl)-N-(4-(isopropylsulfonyl)phenyl)-5-nitropyrimidin-4-amine | CHEMBL461747
Type:
Small organic molecule
Emp. Form.:
C23H29N7O5S
Mol. Mass.:
515.585
SMILES:
CC(C)c1nc([o+][n-]1)C1CCN(CC1)c1ncnc(Nc2ccc(cc2)S(=O)(=O)C(C)C)c1[N+]([O-])=O
: