Target
Glucose-dependent insulinotropic receptor
Ligand
BDBM50244639
Substrate
Meas. Tech.
ChEMBL_512176 (CHEMBL968035)
EC50
25±n/a nM
Citation
 Semple, GFioravanti, BPereira, GCalderon, IUy, JChoi, KXiong, YRen, AMorgan, MDave, VThomsen, WUnett, DJXing, CBossie, SCarroll, CChu, ZLGrottick, AJHauser, EKLeonard, JJones, RM Discovery of the first potent and orally efficacious agonist of the orphan G-protein coupled receptor 119. J Med Chem 51:5172-5 (2008)  
Target
Name:
Glucose-dependent insulinotropic receptor
Synonyms:
G-protein coupled receptor 119 (GPR119) GPR119 | Glucose-dependent insulinotropic receptor
Type:
Protein
Mol. Mass.:
36901.49
Organism:
Homo sapiens (Human)
Description:
Q8TDV5
Residue:
335
  
Inhibitor
Name:
BDBM50244639
Synonyms:
CHEMBL451798 | {6-[4-(3-Cyclopropyl-[1,2,4]oxadiazol-5-yl)-piperidin-1-yl]-5-nitro-pyrimidin-4-yl}-(4-methanesulfonylphenyl)-amine
Type:
Small organic molecule
Emp. Form.:
C21H23N7O5S
Mol. Mass.:
485.516
SMILES:
CS(=O)(=O)c1ccc(Nc2ncnc(N3CCC(CC3)c3nc([n-][o+]3)C3CC3)c2[N+]([O-])=O)cc1
: