Target
B1 bradykinin receptor
Ligand
BDBM50244564
Substrate
Meas. Tech.
ChEMBL_512956 (CHEMBL977292)
Ki
1.5±n/a nM
Citation
 Biswas, KAya, TQian, WPeterkin, TAChen, JJHuman, JHungate, RWKumar, GArik, LLester-Zeiner, DBiddlecome, GManning, BHSun, HDong, HHuang, MLoeloff, RJohnson, EJAskew, BC Aryl sulfones as novel bradykinin B1 receptor antagonists for treatment of chronic pain. Bioorg Med Chem Lett 18:4764-9 (2008)  
Target
Name:
B1 bradykinin receptor
Synonyms:
B1 BRADYKININ B1R BK-1 receptor BRADYB1 | Bradykinin B1 receptor
Type:
Enzyme
Mol. Mass.:
40508.87
Organism:
Homo sapiens (Human)
Description:
P46663
Residue:
353
  
Inhibitor
Name:
BDBM50244564
Synonyms:
4-(naphthalen-2-ylsulfonyl)-3-phenyl-N-((R)-6-(piperidin-1-ylmethyl)-1,2,3,4-tetrahydronaphthalen-1-yl)butanamide | CHEMBL449789
Type:
Small organic molecule
Emp. Form.:
C36H40N2O3S
Mol. Mass.:
580.779
SMILES:
O=C(CC(CS(=O)(=O)c1ccc2ccccc2c1)c1ccccc1)N[C@@H]1CCCc2cc(CN3CCCCC3)ccc12
: