Target
Protein kinase C alpha type
Ligand
BDBM50244981
Substrate
Meas. Tech.
ChEMBL_513186 (CHEMBL977316)
Ki
76±n/a nM
Citation
 El Kazzouli, SLewin, NEBlumberg, PMMarquez, VE Conformationally constrained analogues of diacylglycerol. 30. An investigation of diacylglycerol-lactones containing heteroaryl groups reveals compounds with high selectivity for Ras guanyl nucleotide-releasing proteins. J Med Chem 51:5371-86 (2008)  
Target
Name:
Protein kinase C alpha type
Synonyms:
KPCA_HUMAN PKC alpha and beta-2 PKC-alpha PRKACA Protein Kinase C- alpha Protein kinase C alpha (PKCa) Protein kinase C alpha type (PRKCA) RAF proto-oncogene serine/threonine-protein kinase
Type:
Enzyme
Mol. Mass.:
76755.65
Organism:
Homo sapiens (Human)
Description:
The recombinant human PKC enzymes were produced using a baculovirus expression system in SF9 cells
Residue:
672
  
Inhibitor
Name:
BDBM50244981
Synonyms:
(E)-(2-(hydroxymethyl)-5-oxo-4-(pyridin-3-ylmethylene)-tetrahydrofuran-2-yl)methyl 2-propylpentanoate | CHEMBL472522
Type:
Small organic molecule
Emp. Form.:
C20H27NO5
Mol. Mass.:
361.4321
SMILES:
CCCC(CCC)C(=O)OCC1(CO)C\C(=C/c2cccnc2)C(=O)O1
: