Target
Histamine H3 receptor
Ligand
BDBM50264897
Substrate
Meas. Tech.
ChEMBL_496461 (CHEMBL1004592)
Ki
3.4±n/a nM
Citation
 Aslanian, RZhu, XVaccaro, HAShih, NYPiwinski, JJWilliams, SMWest, RE Benzimidazole-substituted (3-phenoxypropyl)amines as histamine H3 receptor ligands. Bioorg Med Chem Lett 18:5032-6 (2008)  
Target
Name:
Histamine H3 receptor
Synonyms:
G-protein coupled receptor 97 HH3R HRH3 Histamine H3 receptor (H3) Histamine receptor (H3 and H4)
Type:
G Protein-Coupled Receptor (GPCR)
Mol. Mass.:
48691.47
Organism:
Homo sapiens (Human)
Description:
Binding assays were using CHO cells stably expressing hH3R receptors.
Residue:
445
  
Inhibitor
Name:
BDBM50264897
Synonyms:
4-(3-(4-(5-fluoro-2-(pyridin-2-yl)-1H-benzo[d]imidazol-1-yl)phenoxy)propyl)morpholine | CHEMBL522894
Type:
Small organic molecule
Emp. Form.:
C25H25FN4O2
Mol. Mass.:
432.49
SMILES:
Fc1ccc2n(c(nc2c1)-c1ccccn1)-c1ccc(OCCCN2CCOCC2)cc1
: