Target
Histamine H3 receptor
Ligand
BDBM50264935
Substrate
Meas. Tech.
ChEMBL_496461 (CHEMBL1004592)
Ki
5.1±n/a nM
Citation
 Aslanian, RZhu, XVaccaro, HAShih, NYPiwinski, JJWilliams, SMWest, RE Benzimidazole-substituted (3-phenoxypropyl)amines as histamine H3 receptor ligands. Bioorg Med Chem Lett 18:5032-6 (2008)  
Target
Name:
Histamine H3 receptor
Synonyms:
G-protein coupled receptor 97 HH3R HRH3 Histamine H3 receptor (H3) Histamine receptor (H3 and H4)
Type:
G Protein-Coupled Receptor (GPCR)
Mol. Mass.:
48691.47
Organism:
Homo sapiens (Human)
Description:
Binding assays were using CHO cells stably expressing hH3R receptors.
Residue:
445
  
Inhibitor
Name:
BDBM50264935
Synonyms:
1-(4-(3-((2R,5R)-2,5-dimethylpyrrolidin-1-yl)propoxy)phenyl)-5-fluoro-2-(pyridin-2-yl)-1H-benzo[d]imidazole | CHEMBL497354
Type:
Small organic molecule
Emp. Form.:
C27H29FN4O
Mol. Mass.:
444.5438
SMILES:
C[C@@H]1CC[C@@H](C)N1CCCOc1ccc(cc1)-n1c(nc2cc(F)ccc12)-c1ccccn1
: