Target
Histamine H3 receptor
Ligand
BDBM50264974
Substrate
Meas. Tech.
ChEMBL_496461 (CHEMBL1004592)
Ki
4.8±n/a nM
Citation
 Aslanian, RZhu, XVaccaro, HAShih, NYPiwinski, JJWilliams, SMWest, RE Benzimidazole-substituted (3-phenoxypropyl)amines as histamine H3 receptor ligands. Bioorg Med Chem Lett 18:5032-6 (2008)  
Target
Name:
Histamine H3 receptor
Synonyms:
G-protein coupled receptor 97 HH3R HRH3 Histamine H3 receptor (H3) Histamine receptor (H3 and H4)
Type:
G Protein-Coupled Receptor (GPCR)
Mol. Mass.:
48691.47
Organism:
Homo sapiens (Human)
Description:
Binding assays were using CHO cells stably expressing hH3R receptors.
Residue:
445
  
Inhibitor
Name:
BDBM50264974
Synonyms:
(S)-5-fluoro-1-(4-(3-(3-isopropylpyrrolidin-1-yl)propoxy)phenyl)-2-(pyridin-2-yl)-1H-benzo[d]imidazole | CHEMBL521566
Type:
Small organic molecule
Emp. Form.:
C28H31FN4O
Mol. Mass.:
458.5703
SMILES:
CC(C)[C@@H]1CCN(CCCOc2ccc(cc2)-n2c(nc3cc(F)ccc23)-c2ccccn2)C1
: