Target
Histamine H3 receptor
Ligand
BDBM50265015
Substrate
Meas. Tech.
ChEMBL_496461 (CHEMBL1004592)
Ki
16±n/a nM
Citation
 Aslanian, RZhu, XVaccaro, HAShih, NYPiwinski, JJWilliams, SMWest, RE Benzimidazole-substituted (3-phenoxypropyl)amines as histamine H3 receptor ligands. Bioorg Med Chem Lett 18:5032-6 (2008)  
Target
Name:
Histamine H3 receptor
Synonyms:
G-protein coupled receptor 97 HH3R HRH3 Histamine H3 receptor (H3) Histamine receptor (H3 and H4)
Type:
G Protein-Coupled Receptor (GPCR)
Mol. Mass.:
48691.47
Organism:
Homo sapiens (Human)
Description:
Binding assays were using CHO cells stably expressing hH3R receptors.
Residue:
445
  
Inhibitor
Name:
BDBM50265015
Synonyms:
CHEMBL497575 | methyl 1-(3-(4-(5-fluoro-2-(pyridin-2-yl)-1H-benzo[d]imidazol-1-yl)phenoxy)propyl)piperidine-4-carboxylate
Type:
Small organic molecule
Emp. Form.:
C28H29FN4O3
Mol. Mass.:
488.5533
SMILES:
COC(=O)C1CCN(CCCOc2ccc(cc2)-n2c(nc3cc(F)ccc23)-c2ccccn2)CC1
: