Target
Histamine H3 receptor
Ligand
BDBM50265052
Substrate
Meas. Tech.
ChEMBL_496461 (CHEMBL1004592)
Ki
8.7±n/a nM
Citation
 Aslanian, RZhu, XVaccaro, HAShih, NYPiwinski, JJWilliams, SMWest, RE Benzimidazole-substituted (3-phenoxypropyl)amines as histamine H3 receptor ligands. Bioorg Med Chem Lett 18:5032-6 (2008)  
Target
Name:
Histamine H3 receptor
Synonyms:
G-protein coupled receptor 97 HH3R HRH3 Histamine H3 receptor (H3) Histamine receptor (H3 and H4)
Type:
G Protein-Coupled Receptor (GPCR)
Mol. Mass.:
48691.47
Organism:
Homo sapiens (Human)
Description:
Binding assays were using CHO cells stably expressing hH3R receptors.
Residue:
445
  
Inhibitor
Name:
BDBM50265052
Synonyms:
5-fluoro-1-(4-(3-(piperidin-1-yl)propoxy)phenyl)-1H-benzo[d]imidazol-2(3H)-one | CHEMBL497787
Type:
Small organic molecule
Emp. Form.:
C21H24FN3O2
Mol. Mass.:
369.4326
SMILES:
Fc1ccc2n(-c3ccc(OCCCN4CCCCC4)cc3)c(=O)[nH]c2c1
: