Target
Histamine H3 receptor
Ligand
BDBM50265093
Substrate
Meas. Tech.
ChEMBL_496461 (CHEMBL1004592)
Ki
8±n/a nM
Citation
 Aslanian, RZhu, XVaccaro, HAShih, NYPiwinski, JJWilliams, SMWest, RE Benzimidazole-substituted (3-phenoxypropyl)amines as histamine H3 receptor ligands. Bioorg Med Chem Lett 18:5032-6 (2008)  
Target
Name:
Histamine H3 receptor
Synonyms:
G-protein coupled receptor 97 HH3R HRH3 Histamine H3 receptor (H3) Histamine receptor (H3 and H4)
Type:
G Protein-Coupled Receptor (GPCR)
Mol. Mass.:
48691.47
Organism:
Homo sapiens (Human)
Description:
Binding assays were using CHO cells stably expressing hH3R receptors.
Residue:
445
  
Inhibitor
Name:
BDBM50265093
Synonyms:
5-fluoro-1-(4-(3-(piperidin-1-yl)propoxy)phenyl)-1H-benzo[d]imidazole-2(3H)-thione | CHEMBL495723
Type:
Small organic molecule
Emp. Form.:
C21H24FN3OS
Mol. Mass.:
385.498
SMILES:
Fc1ccc2n(-c3ccc(OCCCN4CCCCC4)cc3)c(=S)[nH]c2c1
: