Target
Histamine H3 receptor
Ligand
BDBM50265094
Substrate
Meas. Tech.
ChEMBL_496461 (CHEMBL1004592)
Ki
2.6±n/a nM
Citation
 Aslanian, RZhu, XVaccaro, HAShih, NYPiwinski, JJWilliams, SMWest, RE Benzimidazole-substituted (3-phenoxypropyl)amines as histamine H3 receptor ligands. Bioorg Med Chem Lett 18:5032-6 (2008)  
Target
Name:
Histamine H3 receptor
Synonyms:
G-protein coupled receptor 97 HH3R HRH3 Histamine H3 receptor (H3) Histamine receptor (H3 and H4)
Type:
G Protein-Coupled Receptor (GPCR)
Mol. Mass.:
48691.47
Organism:
Homo sapiens (Human)
Description:
Binding assays were using CHO cells stably expressing hH3R receptors.
Residue:
445
  
Inhibitor
Name:
BDBM50265094
Synonyms:
2-(ethylthio)-5-fluoro-1-(4-(3-(piperidin-1-yl)propoxy)phenyl)-2,3-dihydro-1H-benzo[d]imidazole | CHEMBL495724
Type:
Small organic molecule
Emp. Form.:
C23H30FN3OS
Mol. Mass.:
415.567
SMILES:
CCSC1Nc2cc(F)ccc2N1c1ccc(OCCCN2CCCCC2)cc1
: