Target
Potassium voltage-gated channel subfamily H member 2
Ligand
BDBM50264895
Substrate
Meas. Tech.
ChEMBL_496462 (CHEMBL1004593)
Ki
70±n/a nM
Citation
 Aslanian, RZhu, XVaccaro, HAShih, NYPiwinski, JJWilliams, SMWest, RE Benzimidazole-substituted (3-phenoxypropyl)amines as histamine H3 receptor ligands. Bioorg Med Chem Lett 18:5032-6 (2008)  
Target
Name:
Potassium voltage-gated channel subfamily H member 2
Synonyms:
1,3-beta-glucan synthase component GLS2 ERG Eag-related protein 1 Ether-a-go-go-related gene (HERG) Ether-a-go-go-related gene potassium channel 1 Ether-a-go-go-related gene potassium channel 1 (hERG1) Ether-a-go-go-related protein 1 H-ERG KCNH2 Potassium voltage-gated channel subfamily H member 2 (hERG) Voltage-gated potassium channel subunit Kv11.1 hERG Potassium Channel 1 | putative potassium channel subunit
Type:
Multi-pass membrane protein
Mol. Mass.:
126672.65
Organism:
Homo sapiens (Human)
Description:
Q12809
Residue:
1159
  
Inhibitor
Name:
BDBM50264895
Synonyms:
5-fluoro-1-(4-(3-(piperidin-1-yl)propoxy)phenyl)-2-(pyridin-2-yl)-1H-benzo[d]imidazole | CHEMBL495698
Type:
Small organic molecule
Emp. Form.:
C26H27FN4O
Mol. Mass.:
430.5172
SMILES:
Fc1ccc2n(c(nc2c1)-c1ccccn1)-c1ccc(OCCCN2CCCCC2)cc1
: