Target
Transcriptional activator protein LuxR
Ligand
BDBM50266201
Substrate
Meas. Tech.
ChEMBL_543884 (CHEMBL1016859)
IC50
1400±n/a nM
Citation
 Geske, GDMattmann, MEBlackwell, HE Evaluation of a focused library of N-aryl L-homoserine lactones reveals a new set of potent quorum sensing modulators. Bioorg Med Chem Lett 18:5978-81 (2008)  
Target
Name:
Transcriptional activator protein LuxR
Synonyms:
LUXS_ALIF1 | luxR
Type:
PROTEIN
Mol. Mass.:
28527.37
Organism:
Vibrio fischeri (strain ATCC 700601 / ES114)
Description:
ChEMBL_543884
Residue:
250
  
Inhibitor
Name:
BDBM50266201
Synonyms:
(S)-N-(2-oxotetrahydrofuran-3-yl)-2-(3-(trifluoromethyl)phenyl)acetamide | CHEMBL459084
Type:
Small organic molecule
Emp. Form.:
C13H12F3NO3
Mol. Mass.:
287.2345
SMILES:
FC(F)(F)c1cccc(CC(=O)N[C@H]2CCOC2=O)c1
: