Target
Transcriptional activator protein LuxR
Ligand
BDBM50266236
Substrate
Meas. Tech.
ChEMBL_543884 (CHEMBL1016859)
IC50
1000±n/a nM
Citation
 Geske, GDMattmann, MEBlackwell, HE Evaluation of a focused library of N-aryl L-homoserine lactones reveals a new set of potent quorum sensing modulators. Bioorg Med Chem Lett 18:5978-81 (2008)  
Target
Name:
Transcriptional activator protein LuxR
Synonyms:
LUXS_ALIF1 | luxR
Type:
PROTEIN
Mol. Mass.:
28527.37
Organism:
Vibrio fischeri (strain ATCC 700601 / ES114)
Description:
ChEMBL_543884
Residue:
250
  
Inhibitor
Name:
BDBM50266236
Synonyms:
(S)-2-(4-fluoro-3-(trifluoromethyl)phenyl)-N-(2-oxotetrahydrofuran-3-yl)acetamide | CHEMBL511677
Type:
Small organic molecule
Emp. Form.:
C13H11F4NO3
Mol. Mass.:
305.225
SMILES:
Fc1ccc(CC(=O)N[C@H]2CCOC2=O)cc1C(F)(F)F
: