Target
Histamine H3 receptor
Ligand
BDBM50263324
Substrate
Meas. Tech.
ChEMBL_535494 (CHEMBL986121)
IC50
0.54±n/a nM
Citation
 Jitsuoka, MTsukahara, DIto, STanaka, TTakenaga, NTokita, SSato, N Synthesis and evaluation of a spiro-isobenzofuranone class of histamine H3 receptor inverse agonists. Bioorg Med Chem Lett 18:5101-6 (2008)  
Target
Name:
Histamine H3 receptor
Synonyms:
G-protein coupled receptor 97 HH3R HRH3 Histamine H3 receptor (H3) Histamine receptor (H3 and H4)
Type:
G Protein-Coupled Receptor (GPCR)
Mol. Mass.:
48691.47
Organism:
Homo sapiens (Human)
Description:
Binding assays were using CHO cells stably expressing hH3R receptors.
Residue:
445
  
Inhibitor
Name:
BDBM50263324
Synonyms:
CHEMBL513893 | trans-5'-Methoxy-3'-oxo-3'H-spiro[cyclohexane-1,1'-isobenzofuran]-4-carboxylic acid methyl-(2-piperidin-1-yl-ethyl)-amide
Type:
Small organic molecule
Emp. Form.:
C23H32N2O4
Mol. Mass.:
400.5112
SMILES:
COc1ccc2c(c1)C(=O)O[C@]21CC[C@@H](CC1)C(=O)N(C)CCN1CCCCC1
: