Target
Melatonin receptor type 1B
Ligand
BDBM50263662
Substrate
Meas. Tech.
ChEMBL_535638 (CHEMBL987966)
EC50
0.6±n/a nM
Citation
 Poissonnier-Durieux, SEttaoussi, MPérès, BBoutin, JAAudinot, VBennejean, CDelagrange, PCaignard, DHRenard, PBerthelot, PLesieur, DYous, S Synthesis of 3-phenylnaphthalenic derivatives as new selective MT(2) melatoninergic ligands. Bioorg Med Chem 16:8339-48 (2008)  
Target
Name:
Melatonin receptor type 1B
Synonyms:
MTNR1B Mel-1B-R Melatonin 1B Melatonin receptor type 1B | Melatonin receptor type 2 (MT2)
Type:
Enzyme
Mol. Mass.:
40203.54
Organism:
Homo sapiens (Human)
Description:
P49286
Residue:
362
  
Inhibitor
Name:
BDBM50263662
Synonyms:
CHEMBL476341 | N-[2-(3-(3-Hydroxymethylphenyl)-7-methoxynaphth-1-yl)ethyl]butyramide
Type:
Small organic molecule
Emp. Form.:
C24H27NO3
Mol. Mass.:
377.4761
SMILES:
CCCC(=O)NCCc1cc(cc2ccc(OC)cc12)-c1cccc(CO)c1
: