Target
D(4) dopamine receptor
Ligand
BDBM50253754
Substrate
Meas. Tech.
ChEMBL_539628 (CHEMBL1025633)
Ki
1.1±n/a nM
Citation
 Lazarova, NZoghbi, SSHong, JSeneca, NTuan, EGladding, RLLiow, JSTaku, AInnis, RBPike, VW Synthesis and evaluation of [N-methyl-11C]N-desmethyl-loperamide as a new and improved PET radiotracer for imaging P-gp function. J Med Chem 51:6034-43 (2008)  
Target
Name:
D(4) dopamine receptor
Synonyms:
D(2C) dopamine receptor DOPAMINE D4.2 DRD4 Dopamine D4 receptor
Type:
Enzyme
Mol. Mass.:
48373.19
Organism:
Homo sapiens (Human)
Description:
P21917
Residue:
419
  
Inhibitor
Name:
BDBM50253754
Synonyms:
4-(4-(4-chlorophenyl)-4-hydroxypiperidin-1-yl)-N-methyl-2,2-diphenylbutanamide | CHEMBL1627
Type:
Small organic molecule
Emp. Form.:
C28H31ClN2O2
Mol. Mass.:
463.011
SMILES:
CNC(=O)C(CCN1CCC(O)(CC1)c1ccc(Cl)cc1)(c1ccccc1)c1ccccc1
: