Target
Matrix metalloproteinase-14
Ligand
BDBM26806
Substrate
Meas. Tech.
ChEMBL_497410 (CHEMBL1002951)
Ki
>10000±n/a nM
Citation
 Georgiadis, DYiotakis, A Specific targeting of metzincin family members with small-molecule inhibitors: progress toward a multifarious challenge. Bioorg Med Chem 16:8781-94 (2008)  
Target
Name:
Matrix metalloproteinase-14
Synonyms:
MMP-14 MMP14 MT-MMP 1 MT1MMP Matrix Metalloproteinase-14 (MMP-14) Matrix metalloproteinase-14 Membrane-type matrix metalloproteinase 1 | Membrane-type-1 matrix metalloproteinase
Type:
Protein
Mol. Mass.:
65900.19
Organism:
Homo sapiens (Human)
Description:
P50281
Residue:
582
  
Inhibitor
Name:
BDBM26806
Synonyms:
(3R,4R)-3-N-hydroxy-4-N-(4-{[2-(trifluoromethyl)-1H-1,3-benzodiazol-1-yl]methyl}benzene)oxane-3,4-diamido benzimidazole analog., 32
Type:
Small organic molecule
Emp. Form.:
C22H21F3N4O4
Mol. Mass.:
462.4217
SMILES:
ONC(=O)[C@H]1COCC[C@H]1NC(=O)c1ccc(Cn2c(nc3ccccc23)C(F)(F)F)cc1
: