Target
Interstitial collagenase
Ligand
BDBM26806
Substrate
Meas. Tech.
ChEMBL_497402 (CHEMBL1002943)
Ki
>10000±n/a nM
Citation
 Georgiadis, DYiotakis, A Specific targeting of metzincin family members with small-molecule inhibitors: progress toward a multifarious challenge. Bioorg Med Chem 16:8781-94 (2008)  
Target
Name:
Interstitial collagenase
Synonyms:
CLG MMP1 Matrix metalloproteinase-1 | Matrix metalloproteinase-1 (MMP-1)
Type:
Enzyme
Mol. Mass.:
54010.26
Organism:
Homo sapiens (Human)
Description:
P03956
Residue:
469
  
Inhibitor
Name:
BDBM26806
Synonyms:
(3R,4R)-3-N-hydroxy-4-N-(4-{[2-(trifluoromethyl)-1H-1,3-benzodiazol-1-yl]methyl}benzene)oxane-3,4-diamido benzimidazole analog., 32
Type:
Small organic molecule
Emp. Form.:
C22H21F3N4O4
Mol. Mass.:
462.4217
SMILES:
ONC(=O)[C@H]1COCC[C@H]1NC(=O)c1ccc(Cn2c(nc3ccccc23)C(F)(F)F)cc1
: