Target
Hormone-sensitive lipase
Ligand
BDBM50138744
Substrate
Meas. Tech.
ChEMBL_538751 (CHEMBL1024870)
IC50
12.35±n/a nM
Citation
 Taha, MODahabiyeh, LABustanji, YZalloum, HSaleh, S Combining ligand-based pharmacophore modeling, quantitative structure-activity relationship analysis and in silico screening for the discovery of new potent hormone sensitive lipase inhibitors. J Med Chem 51:6478-94 (2008)  
Target
Name:
Hormone-sensitive lipase
Synonyms:
Hormone-sensitive lipase LIPS_RAT | Lipe
Type:
Enzyme
Mol. Mass.:
116814.94
Organism:
Rattus norvegicus (Rat)
Description:
P15304
Residue:
1068
  
Inhibitor
Name:
BDBM50138744
Synonyms:
5-(hexylthio)-N-methyl-N-phenyl-3-p-tolyl-1H-1,2,4-triazole-1-carboxamide CHEMBL336625
Type:
Small organic molecule
Emp. Form.:
C23H28N4OS
Mol. Mass.:
408.56
SMILES:
CCCCCCSc1nc(nn1C(=O)N(C)c1ccccc1)-c1ccc(C)cc1
: