Target
Mitogen-activated protein kinase 14
Ligand
BDBM50275552
Substrate
Meas. Tech.
ChEMBL_496886 (CHEMBL998555)
IC50
200±n/a nM
Citation
 Cheung, MHarris, PABadiang, JGPeckham, GEChamberlain, SDAlberti, MJJung, DKHarris, SSBramson, NHEpperly, AHStimpson, SAPeel, MR The identification of pyrazolo[1,5-a]pyridines as potent p38 kinase inhibitors. Bioorg Med Chem Lett 18:5428-30 (2008)  
Target
Name:
Mitogen-activated protein kinase 14
Synonyms:
CSAID-binding protein CSBP1 CSPB1 MAP kinase 14 MAP kinase p38 alpha MAPK14 MK14_HUMAN Mitogen-activated protein kinase p38 alpha Stress-activated protein kinase 2a | p38 MAP kinase alpha/beta
Type:
Serine/threonine-protein kinase
Mol. Mass.:
41286.76
Organism:
Homo sapiens (Human)
Description:
Q16539
Residue:
360
  
Inhibitor
Name:
BDBM50275552
Synonyms:
2-(4-fluorophenyl)-3-(pyridin-4-yl)-6-(trifluoromethyl)pyrazolo[1,5-a]pyridine | CHEMBL487781
Type:
Small organic molecule
Emp. Form.:
C19H11F4N3
Mol. Mass.:
357.3044
SMILES:
Fc1ccc(cc1)-c1nn2cc(ccc2c1-c1ccncc1)C(F)(F)F
: