Target
Integrin alpha-4
Ligand
BDBM17909
Substrate
Meas. Tech.
ChEMBL_536254 (CHEMBL987226)
IC50
0.510000±n/a nM
Citation
 Muro, FIimura, SYoneda, YChiba, JWatanabe, TSetoguchi, MIigou, YTakayama, GYokoyama, MTakashi, TNakayama, AMachinaga, N Identification of 4-[1-[3-chloro-4-[N'-(5-fluoro-2-methylphenyl)ureido]phenylacetyl]-(4S)-fluoro-(2S)-pyrrolidinylmethoxy]benzoic acid as a potent, orally active VLA-4 antagonist. Bioorg Med Chem 16:9991-10000 (2008)  
Target
Name:
Integrin alpha-4
Synonyms:
CD49 antigen-like family member D CD49d antigen ITA4_HUMAN Integrin alpha-4 Integrin alpha-IV VLA-4 integrin alpha 4 precursor | integrin alpha-4 precursor
Type:
Membrane Protein
Mol. Mass.:
114897.35
Organism:
Homo sapiens (Human)
Description:
P13612
Residue:
1032
  
Inhibitor
Name:
BDBM17909
Synonyms:
4-{[(2S,4S)-1-[2-(3-chloro-4-{[(2-methylphenyl)carbamoyl]amino}phenyl)acetyl]-4-fluoropyrrolidin-2-yl]methoxy}benzoic acid benzoic acid derivative, 12l
Type:
Small organic molecule
Emp. Form.:
C28H27ClFN3O5
Mol. Mass.:
539.982
SMILES:
Cc1ccccc1NC(=O)Nc1ccc(CC(=O)N2C[C@@H](F)C[C@H]2COc2ccc(cc2)C(O)=O)cc1Cl
: