Target
Estrogen receptor
Ligand
BDBM50253469
Substrate
Meas. Tech.
ChEMBL_536773 (CHEMBL984567)
IC50
11000±n/a nM
Citation
 LaFrate, ALGunther, JRCarlson, KEKatzenellenbogen, JA Synthesis and biological evaluation of guanylhydrazone coactivator binding inhibitors for the estrogen receptor. Bioorg Med Chem 16:10075-84 (2008)  
Target
Name:
Estrogen receptor
Synonyms:
ER ESR ESR1_HUMAN Estrogen receptor Estrogen receptor (ER-alpha) Estrogen receptor alpha (ER) Nuclear receptor subfamily 3 group A member 1
Type:
Protein
Mol. Mass.:
66230.44
Organism:
Homo sapiens (Human)
Description:
P03372
Residue:
595
  
Inhibitor
Name:
BDBM50253469
Synonyms:
1-Chloro-3,4-dihydronaphthalene-2-carboxaldehyde guanylhydrazone CHEMBL448651
Type:
Small organic molecule
Emp. Form.:
C12H13ClN4
Mol. Mass.:
248.711
SMILES:
[#7]\[#6](-[#7])=[#7]\[#7]=[#6]-[#6]-1=[#6](Cl)-c2ccccc2-[#6]-[#6]-1
: