Target
Gag polyprotein
Ligand
BDBM50273853
Substrate
Meas. Tech.
ChEMBL_536774 (CHEMBL984568)
IC50
7800±n/a nM
Citation
 LaFrate, ALGunther, JRCarlson, KEKatzenellenbogen, JA Synthesis and biological evaluation of guanylhydrazone coactivator binding inhibitors for the estrogen receptor. Bioorg Med Chem 16:10075-84 (2008)  
Target
Name:
Gag polyprotein
Synonyms:
GAG_AVIER | gag
Type:
PROTEIN
Mol. Mass.:
61664.68
Organism:
Avian erythroblastosis virus (strain ES4)
Description:
ChEMBL_536774
Residue:
555
  
Inhibitor
Name:
BDBM50273853
Synonyms:
1-Bromo-3,4-dihydronaphthalene-2-carboxaldehyde guanylhydrazone | CHEMBL456599
Type:
Small organic molecule
Emp. Form.:
C12H13BrN4
Mol. Mass.:
293.162
SMILES:
[#7]\[#6](-[#7])=[#7]\[#7]=[#6]-[#6]-1=[#6](Br)-c2ccccc2-[#6]-[#6]-1
: