Target
Gag polyprotein
Ligand
BDBM50273851
Substrate
Meas. Tech.
ChEMBL_536774 (CHEMBL984568)
IC50
1300±n/a nM
Citation
 LaFrate, ALGunther, JRCarlson, KEKatzenellenbogen, JA Synthesis and biological evaluation of guanylhydrazone coactivator binding inhibitors for the estrogen receptor. Bioorg Med Chem 16:10075-84 (2008)  
Target
Name:
Gag polyprotein
Synonyms:
GAG_AVIER | gag
Type:
PROTEIN
Mol. Mass.:
61664.68
Organism:
Avian erythroblastosis virus (strain ES4)
Description:
ChEMBL_536774
Residue:
555
  
Inhibitor
Name:
BDBM50273851
Synonyms:
2-[(3-chloro-1H-inden-2-yl)methylene]hydrazinecarboximidamide | CHEMBL456598
Type:
Small organic molecule
Emp. Form.:
C11H11ClN4
Mol. Mass.:
234.685
SMILES:
[#7]\[#6](-[#7])=[#7]\[#7]=[#6]-[#6]-1=[#6](Cl)-c2ccccc2-[#6]-1
: