Target
Gag polyprotein
Ligand
BDBM50273849
Substrate
Meas. Tech.
ChEMBL_536774 (CHEMBL984568)
IC50
1200±n/a nM
Citation
 LaFrate, ALGunther, JRCarlson, KEKatzenellenbogen, JA Synthesis and biological evaluation of guanylhydrazone coactivator binding inhibitors for the estrogen receptor. Bioorg Med Chem 16:10075-84 (2008)  
Target
Name:
Gag polyprotein
Synonyms:
GAG_AVIER | gag
Type:
PROTEIN
Mol. Mass.:
61664.68
Organism:
Avian erythroblastosis virus (strain ES4)
Description:
ChEMBL_536774
Residue:
555
  
Inhibitor
Name:
BDBM50273849
Synonyms:
1-Chloro-5,7-dimethyl-3,4-dihydronaphthalene-2-carboxaldehyde guanylhydrazone | CHEMBL456392
Type:
Small organic molecule
Emp. Form.:
C14H17ClN4
Mol. Mass.:
276.765
SMILES:
[#6]-c1cc(-[#6])c2-[#6]-[#6]-[#6](-[#6]=[#7]\[#7]=[#6](\[#7])-[#7])=[#6](Cl)-c2c1
: