Target
Gag polyprotein
Ligand
BDBM50273848
Substrate
Meas. Tech.
ChEMBL_536774 (CHEMBL984568)
IC50
2000±n/a nM
Citation
 LaFrate, ALGunther, JRCarlson, KEKatzenellenbogen, JA Synthesis and biological evaluation of guanylhydrazone coactivator binding inhibitors for the estrogen receptor. Bioorg Med Chem 16:10075-84 (2008)  
Target
Name:
Gag polyprotein
Synonyms:
GAG_AVIER | gag
Type:
PROTEIN
Mol. Mass.:
61664.68
Organism:
Avian erythroblastosis virus (strain ES4)
Description:
ChEMBL_536774
Residue:
555
  
Inhibitor
Name:
BDBM50273848
Synonyms:
1-Chloro-6-methoxy-3,4-dihydronaphthalene-2-carboxaldehyde guanylhydrazone | CHEMBL456106
Type:
Small organic molecule
Emp. Form.:
C13H15ClN4O
Mol. Mass.:
278.737
SMILES:
[#6]-[#8]-c1ccc2-[#6](Cl)=[#6](-[#6]-[#6]-c2c1)-[#6]=[#7]\[#7]=[#6](\[#7])-[#7]
: