Target
Peptide deformylase
Ligand
BDBM50255034
Substrate
Meas. Tech.
ChEMBL_559976 (CHEMBL1014575)
IC50
161±n/a nM
Citation
 Pichota, ADuraiswamy, JYin, ZKeller, THAlam, JLiung, SLee, GDing, MWang, GChan, WLSchreiber, MMa, IBeer, DNgew, XMukherjee, KNanjundappa, MTeo, JWThayalan, PYap, ADick, TMeng, WXu, MKoehn, JPan, SHClark, KXie, XShoen, CCynamon, M Peptide deformylase inhibitors of Mycobacterium tuberculosis: synthesis, structural investigations, and biological results. Bioorg Med Chem Lett 18:6568-72 (2008)  
Target
Name:
Peptide deformylase
Synonyms:
DEF_MYCTU | def
Type:
PROTEIN
Mol. Mass.:
20931.95
Organism:
Mycobacterium tuberculosis
Description:
ChEMBL_559976
Residue:
197
  
Inhibitor
Name:
BDBM50255034
Synonyms:
CHEMBL518077 | N-((R)-3-((S)-2-(benzo[d]oxazol-2-yl)pyrrolidin-1-yl)-2-benzyl-3-oxopropyl)-N-hydroxyformamide
Type:
Small organic molecule
Emp. Form.:
C22H23N3O4
Mol. Mass.:
393.4357
SMILES:
ON(C[C@@H](Cc1ccccc1)C(=O)N1CCC[C@H]1c1nc2ccccc2o1)C=O
: