Target
Cannabinoid receptor 1
Ligand
BDBM50254680
Substrate
Meas. Tech.
ChEMBL_558495 (CHEMBL963901)
IC50
22.2±n/a nM
Citation
 Kim, JYSeo, HJLee, SHJung, MEAhn, KKim, JLee, J Diarylimidazolyl oxadiazole and thiadiazole derivatives as cannabinoid CB1 receptor antagonists. Bioorg Med Chem Lett 19:142-5 (2008)  
Target
Name:
Cannabinoid receptor 1
Synonyms:
Brain-type cannabinoid receptor CB-R CNR1_RAT Cannabinoid receptor Cnr1 | Skr6
Type:
G Protein-Coupled Receptor (GPCR)
Mol. Mass.:
52856.55
Organism:
Rattus norvegicus (rat)
Description:
P20272
Residue:
473
  
Inhibitor
Name:
BDBM50254680
Synonyms:
2-(1-(4-chlorophenyl)-2-(2,4-dichlorophenyl)-5-methyl-1H-imidazol-4-yl)-5-isopropyl-1,3,4-thiadiazole | CHEMBL481785
Type:
Small organic molecule
Emp. Form.:
C21H17Cl3N4S
Mol. Mass.:
463.81
SMILES:
CC(C)c1nnc(s1)-c1nc(-c2ccc(Cl)cc2Cl)n(c1C)-c1ccc(Cl)cc1
: