Target
High affinity cAMP-specific 3',5'-cyclic phosphodiesterase 7A
Ligand
BDBM50273512
Substrate
Meas. Tech.
ChEMBL_537823 (CHEMBL989824)
IC50
>50000±n/a nM
Citation
 Zheng, SKaur, GWang, HLi, MMacnaughtan, MYang, XReid, SPrestegard, JWang, BKe, H Design, synthesis, and structure-activity relationship, molecular modeling, and NMR studies of a series of phenyl alkyl ketones as highly potent and selective phosphodiesterase-4 inhibitors. J Med Chem 51:7673-88 (2008)  
Target
Name:
High affinity cAMP-specific 3',5'-cyclic phosphodiesterase 7A
Synonyms:
3',5'-cyclic phosphodiesterase PDE7A_HUMAN Phosphodiesterase 7 (PDE7) Phosphodiesterase 7A (PDE7A1)
Type:
Enzyme
Mol. Mass.:
55514.96
Organism:
Homo sapiens (Human)
Description:
Q13946
Residue:
482
  
Inhibitor
Name:
BDBM50273512
Synonyms:
1-[4-Difluoromethoxy-3-(tetrahydrofuran-3-yloxy)phenyl]-3-methylbutan-1-one | CHEMBL458298
Type:
Small organic molecule
Emp. Form.:
C16H20F2O4
Mol. Mass.:
314.3244
SMILES:
CC(C)CC(=O)c1ccc(OC(F)F)c(OC2CCOC2)c1
: