Target
High affinity cGMP-specific 3',5'-cyclic phosphodiesterase 9A
Ligand
BDBM50273512
Substrate
Meas. Tech.
ChEMBL_537824 (CHEMBL989825)
IC50
>50000±n/a nM
Citation
 Zheng, SKaur, GWang, HLi, MMacnaughtan, MYang, XReid, SPrestegard, JWang, BKe, H Design, synthesis, and structure-activity relationship, molecular modeling, and NMR studies of a series of phenyl alkyl ketones as highly potent and selective phosphodiesterase-4 inhibitors. J Med Chem 51:7673-88 (2008)  
Target
Name:
High affinity cGMP-specific 3',5'-cyclic phosphodiesterase 9A
Synonyms:
3',5'-cyclic phosphodiesterase PDE9A_HUMAN Phosphodiesterase 9A (PDE9) | Phosphodiesterase 9A (PDE9A)
Type:
Protein
Mol. Mass.:
68488.40
Organism:
Homo sapiens (Human)
Description:
O76083
Residue:
593
  
Inhibitor
Name:
BDBM50273512
Synonyms:
1-[4-Difluoromethoxy-3-(tetrahydrofuran-3-yloxy)phenyl]-3-methylbutan-1-one | CHEMBL458298
Type:
Small organic molecule
Emp. Form.:
C16H20F2O4
Mol. Mass.:
314.3244
SMILES:
CC(C)CC(=O)c1ccc(OC(F)F)c(OC2CCOC2)c1
: