Target
ATP-dependent translocase ABCB1
Ligand
BDBM50234488
Substrate
Meas. Tech.
ChEMBL_494039 (CHEMBL938573)
IC50
180±n/a nM
Citation
 Colabufo, NABerardi, FPerrone, RRapposelli, SDigiacomo, MVanni, MBalsamo, A 2-[(3-Methoxyphenylethyl)phenoxy]-based ABCB1 inhibitors: effect of different basic side-chains on their biological properties. J Med Chem 51:7602-13 (2008)  
Target
Name:
ATP-dependent translocase ABCB1
Synonyms:
ABCB1 MDR1_HUMAN Multidrug resistance protein 1 P-glycoprotein (P-gp) PGY1
Type:
Protein
Mol. Mass.:
141503.50
Organism:
Homo sapiens (Human)
Description:
P08183
Residue:
1280
  
Inhibitor
Name:
BDBM50234488
Synonyms:
CHEMBL272036 N-[(3,4-dimethoxy)benzyl]-2-[2-(3-methoxyphenyl)ethyl]aniline
Type:
Small organic molecule
Emp. Form.:
C24H27NO3
Mol. Mass.:
377.4761
SMILES:
COc1cccc(CCc2ccccc2NCc2ccc(OC)c(OC)c2)c1
: