Target
ATP-dependent translocase ABCB1
Ligand
BDBM50275324
Substrate
Meas. Tech.
ChEMBL_494043 (CHEMBL938577)
IC50
350±n/a nM
Citation
 Colabufo, NABerardi, FPerrone, RRapposelli, SDigiacomo, MVanni, MBalsamo, A 2-[(3-Methoxyphenylethyl)phenoxy]-based ABCB1 inhibitors: effect of different basic side-chains on their biological properties. J Med Chem 51:7602-13 (2008)  
Target
Name:
ATP-dependent translocase ABCB1
Synonyms:
ABCB1 MDR1_HUMAN Multidrug resistance protein 1 P-glycoprotein (P-gp) PGY1
Type:
Protein
Mol. Mass.:
141503.50
Organism:
Homo sapiens (Human)
Description:
P08183
Residue:
1280
  
Inhibitor
Name:
BDBM50275324
Synonyms:
5-{2-[2-(3-Methoxyphenyl)ethyl]phenoxy}propyl-(6,7-dimethoxy-3,4-dihydroisoquinoline) | CHEMBL519547
Type:
Small organic molecule
Emp. Form.:
C31H39NO4
Mol. Mass.:
489.6457
SMILES:
COc1cccc(CCc2ccccc2OCCCCCN2CCc3cc(OC)c(OC)cc3C2)c1
: