Target
5-hydroxytryptamine receptor 1A
Ligand
BDBM50275324
Substrate
Meas. Tech.
ChEMBL_494046 (CHEMBL938580)
Ki
>5000000±n/a nM
Citation
 Colabufo, NABerardi, FPerrone, RRapposelli, SDigiacomo, MVanni, MBalsamo, A 2-[(3-Methoxyphenylethyl)phenoxy]-based ABCB1 inhibitors: effect of different basic side-chains on their biological properties. J Med Chem 51:7602-13 (2008)  
Target
Name:
5-hydroxytryptamine receptor 1A
Synonyms:
5-HT-1A 5-hydroxytryptamine receptor 1A (5-HT-1A) ADRB2RL1 Dopamine D2 receptor and serotonin 1a receptor HTR1A | Serotonin receptor 1A
Type:
Mol. Mass.:
46122.49
Organism:
Homo sapiens (Human)
Description:
Residue:
422
  
Inhibitor
Name:
BDBM50275324
Synonyms:
5-{2-[2-(3-Methoxyphenyl)ethyl]phenoxy}propyl-(6,7-dimethoxy-3,4-dihydroisoquinoline) | CHEMBL519547
Type:
Small organic molecule
Emp. Form.:
C31H39NO4
Mol. Mass.:
489.6457
SMILES:
COc1cccc(CCc2ccccc2OCCCCCN2CCc3cc(OC)c(OC)cc3C2)c1
: