Target
Aromatase
Ligand
BDBM50097367
Substrate
Meas. Tech.
ChEMBL_560809 (CHEMBL1011777)
IC50
89±n/a nM
Citation
 Neves, MADinis, TCColombo, GSá e Melo, ML Fast three dimensional pharmacophore virtual screening of new potent non-steroid aromatase inhibitors. J Med Chem 52:143-50 (2009)  
Target
Name:
Aromatase
Synonyms:
ARO1 CP19A_HUMAN CYP19 CYPXIX Cytochrome P450 19A1 Cytochrome P450-C19 (CYP19) FL cytokine receptor precursor | P-450AROM
Type:
Enzyme
Mol. Mass.:
57888.92
Organism:
Homo sapiens (Human)
Description:
P11511
Residue:
503
  
Inhibitor
Name:
BDBM50097367
Synonyms:
1-Bromo-4-imidazol-1-ylmethyl-xanthen-9-one CHEMBL421829
Type:
Small organic molecule
Emp. Form.:
C17H11BrN2O2
Mol. Mass.:
355.185
SMILES:
Brc1ccc(Cn2ccnc2)c2oc3ccccc3c(=O)c12
: