Target
D(3) dopamine receptor
Ligand
BDBM50265374
Substrate
Meas. Tech.
ChEMBL_558362 (CHEMBL954164)
Ki
3.2±n/a nM
Citation
 Butini, SGemma, SCampiani, GFranceschini, STrotta, FBorriello, MCeres, NRos, SCoccone, SSBernetti, MDe Angelis, MBrindisi, MNacci, VFiorini, INovellino, ECagnotto, AMennini, TSandager-Nielsen, KAndreasen, JTScheel-Kruger, JMikkelsen, JDFattorusso, C Discovery of a new class of potential multifunctional atypical antipsychotic agents targeting dopamine D3 and serotonin 5-HT1A and 5-HT2A receptors: design, synthesis, and effects on behavior. J Med Chem 52:151-69 (2009)  
Target
Name:
D(3) dopamine receptor
Synonyms:
DOPAMINE D3 DRD3_HUMAN Dopamine D3 receptor (D3) Dopamine receptor Dopamine receptor D3
Type:
Mol. Mass.:
44243.43
Organism:
Homo sapiens (Human)
Description:
Residue:
400
  
Inhibitor
Name:
BDBM50265374
Synonyms:
CHEMBL497574 | N-[4-[4-(2,4-Dichlorophenyl)piperazin-1-yl]butyl]3,4-dihydropyrazino[1,2-a]indol-1(2H)-one
Type:
Small organic molecule
Emp. Form.:
C25H28Cl2N4O
Mol. Mass.:
471.422
SMILES:
Clc1ccc(N2CCN(CCCCN3CCn4c(cc5ccccc45)C3=O)CC2)c(Cl)c1
: