Target
Cannabinoid receptor 2
Ligand
BDBM50277266
Substrate
Meas. Tech.
ChEMBL_540512 (CHEMBL1030616)
Ki
36±n/a nM
Citation
 Goodman, AJAjello, CWWorm, KLe Bourdonnec, BSavolainen, MAO'Hare, HCassel, JAStabley, GJDehaven, RNLabuda, CJKoblish, MLittle, PJBrogdon, BLSmith, SADolle, RE CB2 selective sulfamoyl benzamides: optimization of the amide functionality. Bioorg Med Chem Lett 19:309-13 (2008)  
Target
Name:
Cannabinoid receptor 2
Synonyms:
CANNABINOID CB2 CB2 CB2B CNR2_HUMAN Cannabinoid CB2 receptor Cannabinoid receptor 2 (CB2R) | hCB2
Type:
G Protein-Coupled Receptor (GPCR)
Mol. Mass.:
39690.94
Organism:
Homo sapiens (Human)
Description:
P34972
Residue:
360
  
Inhibitor
Name:
BDBM50277266
Synonyms:
4-(2-methyl-5-(4-neopentyl-1H-imidazol-2-yl)phenylsulfonyl)morpholine | CHEMBL474300
Type:
Small organic molecule
Emp. Form.:
C19H27N3O3S
Mol. Mass.:
377.501
SMILES:
Cc1ccc(cc1S(=O)(=O)N1CCOCC1)-c1nc(CC(C)(C)C)c[nH]1
: